{"text_format":"1","workbook":"xlsx","n_sheets":21,"sheets":["Select sheets","Base data","Statement - SZRB guarantee","List of required documents","Additional financial data JU","Additional financial data PU","Customers, suppliers JU","Analysis of revenues PU","Customers, suppliers PU","Receiv., liabilities,stock JU","Receiv., liabilities,stock PU","Loans, liabilities, leasing JU","Loans, liabilities, leasing PU","Additional information","Owners management, shares PU ","A-Assets and liab. projections","A-Income and expend. project.","A - Balance sheet projections","B - Profit and loss projections","Verzia","Preliminary interest-FACTORING"],"not_rendered":{"charts":4,"images":13,"macros":1,"external_links":1,"defined_names":30,"comments":3,"pivot_tables":0},"unopened":[],"bounds":{"document_bytes":16777216,"sheet_cells":100000,"rows_first":2000,"rows_last":500,"rows_between":2000,"halvings":0,"cell_chars":16384,"cell_head_chars":4096},"cells_cut":0,"cells_raw":0,"read":"whole","date_system":"1900"}

{"sheet":"Select sheets","index":0,"n_rows":138,"n_cols":10,"rows_kept":138,"cut":false,"hidden":false,"merged":[]}
[]
["Select sheets:",null,null,null,null,null,null,null,"Version:","3.5.0"]
[]
[null,"Bookeeping method"]
[]
[]
[]
[]
[]
[]
{"$rows_left_out":129}
{"sheet":"Base data","index":1,"n_rows":67,"n_cols":6,"rows_kept":67,"cut":false,"hidden":false,"merged":[[38,1,38,3],[37,1,37,3],[61,4,61,5],[61,1,61,2],[62,1,62,2],[55,3,55,5],[18,11,18,12],[19,8,19,10],[19,11,19,12],[6,1,6,5],[8,1,8,5],[10,1,10,2],[12,1,12,5],[10,4,10,5],[20,8,20,10],[20,11,20,12],[18,8,18,10],[40,1,40,3],[40,4,40,5],[21,11,21,12],[23,8,23,10],[23,11,23,12],[24,8,24,10],[24,11,24,12],[21,8,21,10],[38,4,38,5],[37,4,37,5],[36,1,36,3],[36,4,36,5],[31,1,31,4],[1,0,1,5],[32,1,32,4],[56,3,56,5],[41,1,41,3],[41,4,41,5],[42,1,42,3],[42,4,42,5],[14,2,14,4],[18,1,18,5],[20,1,20,2],[22,1,22,5],[29,1,29,4],[30,1,30,4],[24,1,24,5],[26,1,26,5],[28,1,28,4]]}
[null,"CRP for double-entry bookeeping"]
["Basic client identification data"]
[]
["Client´s basic data"]
[]
[]
["Name:"]
[]
["Address:"]
[]
{"$rows_left_out":58}
{"sheet":"Statement - SZRB guarantee","index":2,"n_rows":47,"n_cols":5,"rows_kept":47,"cut":false,"hidden":true,"merged":[[3,2,3,3],[9,2,9,3],[6,2,6,3],[41,3,41,4],[29,3,29,4],[30,3,30,4],[40,3,40,4]]}
[]
["Klient: "]
[null,{"$f":"\"Client: \"&IF('Base data'!$B$7=0,\"\",'Base data'!$B$7)","v":"Client: "}]
["Zoznam dokumentov požadovaných bankou pre stanovenie ratingu a posúdenie žiadosti o úver ",null,"Vyhlásenie klienta pre potreby Záruky SZRB"]
[]
["Pozn. Predložte prosím krížikom označené dokumenty"]
[null,null,"Klient čestne vyhlasuje, že nemá záväzky po lehote splatnosti voči Sociálnej poisťovni a.s., daňovým úradom, iným správcom dane, úradom práce sociálnych vecí a rodiny a zdravotným poisťovniam, a že voči nemu nie sú vedené súdne spory o zaplatenie peňažných dávok, návrh na exekúciu, výkon rozhodnutia, konkurz, reštrukturalizácia resp. vyrovnanie v zmysle zákona č. 7/2005 Z.z. o konkurze a reštrukturalizácii v znení neskorších predpisov."]
[]
[]
[null,null,"Klient vyhlasuje, že v „CRP“, vrátane príloh a dokladov na predloženie, ktorých bol vyzvaný bankou uviedol všetky údaje, skutočnosti a zámery úplne a pravdivo a nezatajil žiadne svoje záväzky a majetok, ktorý by bol vhodný na zabezpečenie úveru."]
{"$rows_left_out":38}
{"sheet":"List of required documents","index":3,"n_rows":64,"n_cols":5,"rows_kept":64,"cut":false,"hidden":true,"merged":[[60,2,60,3],[58,2,58,3],[57,2,57,3],[19,3,19,6],[20,3,20,6],[21,3,21,6],[59,2,59,3],[21,0,21,1],[12,0,12,1],[10,3,10,6],[11,3,11,6],[12,3,12,6],[13,3,13,6],[14,3,14,6],[13,0,13,1],[14,0,14,1],[19,0,19,1],[10,0,10,1],[11,0,11,1],[15,0,15,1],[18,0,18,1],[15,3,15,6],[18,3,18,6],[6,0,6,1],[8,0,8,1],[8,3,8,6],[6,3,6,6],[20,0,20,1],[7,0,7,1],[9,3,9,6],[9,0,9,1],[16,3,16,6],[17,3,17,6],[16,0,16,1],[17,0,17,1]]}
[]
[{"$f":"\"Client: \"&IF('Base data'!$B$7=0,\"\",'Base data'!$B$7)","v":"Client: "}]
[]
["List of documents required by bank for determination of rating and assessment of credit application "]
[]
[]
["Document",null,"Form ","Condition"]
["GENERAL DOCUMENTS:"]
["Commercial register or business licence",null,"O","current, not older then 3 months in time of loan documentation signing"]
["Deed of foundation, partnership contract and statutes",null,"C","current"]
{"$rows_left_out":55}
{"sheet":"Additional financial data JU","index":4,"n_rows":91,"n_cols":8,"rows_kept":91,"cut":false,"hidden":true,"merged":[[90,0,90,14],[53,0,53,4],[78,0,78,6],[80,0,80,6],[81,0,82,0],[81,1,81,2],[81,3,81,4],[81,5,81,6],[8,1,10,1],[49,1,50,1],[18,0,18,4],[39,1,48,1],[24,0,24,1],[25,0,25,1],[34,1,38,1],[11,1,13,1],[14,1,17,1]]}
[]
[{"$f":"\"Klient: \"&IF('Base data'!$B$7=0,\"\",'Base data'!$B$7)","v":"Klient: "}]
[]
["Doplňujúce údaje  k Výkazu o majetku a záväzkoch a počet zamestnancov"]
[]
[]
[null,null,null,null,"(EUR 000)"]
["Položka","Riadok",{"$f":"'List of required documents'!B61","v":"2010-12-31"},{"$f":"'List of required documents'!C61","v":"2011-12-31"},{"$f":"'List of required documents'!E61","v":"2012-03-31"}]
["Pozemky",2]
["Stavby"]
{"$rows_left_out":82}
{"sheet":"Additional financial data PU","index":5,"n_rows":89,"n_cols":7,"rows_kept":89,"cut":false,"hidden":true,"merged":[[28,0,28,6],[36,0,36,2],[37,0,37,2],[49,1,50,1],[49,3,50,3],[85,0,85,6],[49,4,50,4],[49,5,50,5],[49,6,50,6],[59,1,60,1],[59,3,60,3],[59,4,60,4],[59,5,60,5],[59,6,60,6],[83,0,83,6]]}
[]
[{"$f":"\"Client: \"&IF('Base data'!$B$7=0,\"\",'Base data'!$B$7)","v":"Client: "}]
[]
["Additional data to balance sheet"]
[null,null,null,null,null,null,"(EUR 000)"]
["Item","Account","Line*","2008-12-31",{"$f":"'List of required documents'!B61","v":"2010-12-31"},{"$f":"'List of required documents'!C61","v":"2011-12-31"},{"$f":"'List of required documents'!E61","v":"2012-03-31"}]
["Long term advance payments",314,"039 (041)"]
["Short term advance payments",314,"047 (048)"]
["Long term trade account receivables from subsidiary and parent","311A, 315A","039 (041)"]
["Long term loans given to controling entity (parent company)                                                1)                          ","351A","041 (042)"]
{"$rows_left_out":80}
{"sheet":"Customers, suppliers JU","index":6,"n_rows":54,"n_cols":13,"rows_kept":54,"cut":false,"hidden":true,"merged":[[0,1,0,7],[16,0,16,12],[36,0,36,12]]}
[]
[{"$f":"\"Klient: \"&IF('Base data'!$B$7=0,\"\",'Base data'!$B$7)","v":"Klient: "}]
[]
["Uveďte minimálne 5 najväčších odberateľov podľa podielu na príjmoch"]
[{"$f":"\"Pozn.: Štruktúru odberateľov k \"&TEXT('List of required documents'!$C$61,\"dd.mm.yyyy\")&\" považujte za východiskovú.\"","v":"Pozn.: Štruktúru odberateľov k 31.12.2011 považujte za východiskovú."},null,null,null,null,null,null,null,null,null,null,null,"(EUR 000)"]
["Názov odberateľa","Štát odberateľa","Forma spolupráce 1)","Dĺžka spolupráce (v rokoch)","Obsah dodávok","Mena 2)","Dohodnuté splatnosti (počet dní)",{"$f":"'List of required documents'!B61","v":"2010-12-31"},"Podiel [%]",{"$f":"'List of required documents'!C61","v":"2011-12-31"},"Podiel [%]",{"$f":"'List of required documents'!E61","v":"2012-03-31"},"Podiel [%]"]
[null,null,null,null,null,null,null,null,{"$f":"IF(H$13=\"\",\"\",H7/H$13)","v":""},null,{"$f":"IF(J$13=\"\",\"\",J7/J$13)","v":""},null,{"$f":"IF(L$13=\"\",\"\",L7/L$13)","v":""}]
[null,null,null,null,null,null,null,null,"",null,"",null,""]
[null,null,null,null,null,null,null,null,"",null,"",null,""]
[null,null,null,null,null,null,null,null,"",null,"",null,""]
{"$rows_left_out":45}
{"sheet":"Analysis of revenues PU","index":7,"n_rows":58,"n_cols":7,"rows_kept":58,"cut":false,"hidden":true,"merged":[[40,0,40,6],[29,0,29,6],[42,0,42,14],[33,0,34,0],[31,0,31,6],[33,5,33,6],[33,1,33,2],[33,3,33,4]]}
[" "]
[{"$f":"\"Client: \"&IF('Base data'!$B$7=0,\"\",'Base data'!$B$7)","v":"Client: "}]
[]
["Analyses of revenues by business activities"]
[null,null,null,null,null,null,"(EUR 000)"]
["Business activity",{"$f":"'List of required documents'!B61","v":"2010-12-31"},"Share",{"$f":"'List of required documents'!C61","v":"2011-12-31"},"Share",{"$f":"'List of required documents'!E61","v":"2012-03-31"},"Share"]
["Revenues total, from that:",null,{"$f":"IF(B7=0,\"\",B7/B$8)","v":""},null,{"$f":"IF(D7=0,\"\",D7/D$8)","v":""},null,{"$f":"IF(F7=0,\"\",F7/F$8)","v":""}]
["Revenues from the sale of own products total (účet 601), from that:",null,{"$f":"IF(B7=0,\"\",B8/B$8)","v":""},null,{"$f":"IF(D7=0,\"\",D8/D$8)","v":""},null,{"$f":"IF(F7=0,\"\",F8/F$8)","v":""}]
[null,null,{"$f":"IF(B7=0,\"\",B9/B$8)","v":""},null,{"$f":"IF(D7=0,\"\",D9/D$8)","v":""},null,{"$f":"IF(F7=0,\"\",F9/F$8)","v":""}]
[null,null,{"$f":"IF(B7=0,\"\",B10/B$8)","v":""},null,{"$f":"IF(D7=0,\"\",D10/D$8)","v":""},null,{"$f":"IF(F7=0,\"\",F10/F$8)","v":""}]
{"$rows_left_out":49}
{"sheet":"Customers, suppliers PU","index":8,"n_rows":65,"n_cols":15,"rows_kept":65,"cut":false,"hidden":true,"merged":[[0,1,0,14],[15,0,15,14],[40,0,40,14]]}
[]
[{"$f":"\"Client: \"&IF('Base data'!$B$7=0,\"\",'Base data'!$B$7)","v":"Client: "}]
[]
["5 current main customers due to revenues share (601, 602, 604)"]
[null,null,null,null,null,null,null,null,null,null,null,null,null,null,"(EUR 000)"]
["Name of customer","Customer state","Form of cooperation 1)","Time of cooperation (in years)","Content of supplies","Currency 2)","Contractual payments (number of days)",{"$f":"#REF!","v":{"$error":"#REF!"}},"Podiel [%]",{"$f":"#REF!","v":{"$error":"#REF!"}},"Podiel [%]",{"$f":"'List of required documents'!C61","v":"2011-12-31"},"Share\n[%]",{"$f":"'List of required documents'!E61","v":"2012-03-31"},"Share\n[%]"]
[null,null,null,null,null,null,null,null,{"$f":"IF(H$13=\"\",\"\",H7/H$13)","v":{"$error":"#REF!"}},null,{"$f":"IF(J$13=\"\",\"\",J7/J$13)","v":{"$error":"#REF!"}},null,{"$f":"IF(L$13=\"\",\"\",L7/L$13)","v":""},null,{"$f":"IF(N$13=\"\",\"\",N7/N$13)","v":""}]
[null,null,null,null,null,null,null,null,{"$error":"#REF!"},null,{"$error":"#REF!"},null,"",null,""]
[null,null,null,null,null,null,null,null,{"$error":"#REF!"},null,{"$error":"#REF!"},null,"",null,""]
[null,null,null,null,null,null,null,null,{"$error":"#REF!"},null,{"$error":"#REF!"},null,"",null,""]
{"$rows_left_out":56}
{"sheet":"Receiv., liabilities,stock JU","index":9,"n_rows":118,"n_cols":21,"rows_kept":118,"cut":false,"hidden":true,"merged":[[113,7,113,14],[114,7,114,14],[115,7,115,14],[111,7,112,14],[113,3,113,4],[114,3,114,4],[115,3,115,4],[113,5,113,6],[114,5,114,6],[115,5,115,6],[111,0,112,0],[107,5,107,6],[111,3,112,4],[111,5,112,6],[103,3,104,4],[103,5,104,6],[105,3,105,4],[105,5,105,6],[106,3,106,4],[106,5,106,6],[0,1,0,8],[103,0,104,0],[103,7,104,14],[105,7,105,14],[107,3,107,4],[106,7,106,14],[107,7,107,14]]}
[]
[{"$f":"\"Klient: \"&IF('Base data'!$B$7=0,\"\",'Base data'!$B$7)","v":"Klient: "}]
[]
["Časová štruktúra pohľadávok z obchodného styku",null,null,null,null,null,null,null,null,null,null,null,null,null,null,null,null,"Hodnoty pre graf"]
[null,null,null,null,null,null,"(EUR 000)"]
[null,{"$f":"'List of required documents'!B61","v":"2010-12-31"},"Podiel",{"$f":"'List of required documents'!C61","v":"2011-12-31"},"Podiel",{"$f":"'List of required documents'!E61","v":"2012-03-31"},"Podiel",null,null,null,null,null,null,null,null,null,null,{"$f":"#REF!","v":{"$error":"#REF!"}},{"$f":"B6","v":"2010-12-31"},{"$f":"D6","v":"2011-12-31"},{"$f":"F6","v":"2012-03-31"}]
["Pohľadávky z OS celkom, z toho:",null,{"$f":"IF(B$7=0,\"\",B7/B$7)","v":""},null,{"$f":"IF(D$7=0,\"\",D7/D$7)","v":""},null,{"$f":"IF(F$7=0,\"\",F7/F$7)","v":""},null,null,null,null,null,null,null,null,null,null,{"$f":"#REF!","v":{"$error":"#REF!"}},{"$f":"B7","v":0},{"$f":"D7","v":0},{"$f":"F7","v":0}]
[" - Do lehoty splatnosti",{"$f":"IF(B7=0,\"\",B7-SUM(B10:B14))","v":""},{"$f":"IF(B$7=0,\"\",B8/B$7)","v":""},{"$f":"IF(D7=0,\"\",D7-SUM(D10:D14))","v":""},{"$f":"IF(D$7=0,\"\",D8/D$7)","v":""},{"$f":"IF(F7=0,\"\",F7-SUM(F10:F14))","v":""},{"$f":"IF(F$7=0,\"\",F8/F$7)","v":""},null,null,null,null,null,null,null,null,null,null,{"$f":"#REF!","v":{"$error":"#REF!"}},"","",""]
[" - Po lehote splatnosti celkom, z toho:",{"$f":"IF(SUM(B10:B14)=0,\"\",SUM(B10:B14))","v":""},{"$f":"IF(SUM(B10:B14)=0,\"\",B9/B$7)","v":""},{"$f":"IF(SUM(D10:D14)=0,\"\",SUM(D10:D14))","v":""},{"$f":"IF(SUM(D10:D14)=0,\"\",D9/D$7)","v":""},{"$f":"IF(SUM(F10:F14)=0,\"\",SUM(F10:F14))","v":""},{"$f":"IF(SUM(F10:F14)=0,\"\",F9/F$7)","v":""}]
["    - do 30 dní po LS",null,{"$f":"IF(B$7=0,\"\",B10/B$7)","v":""},null,{"$f":"IF(D$7=0,\"\",D10/D$7)","v":""},null,{"$f":"IF(F$7=0,\"\",F10/F$7)","v":""},null,null,null,null,null,null,null,null,null,null,{"$f":"#REF!","v":{"$error":"#REF!"}},0,0,0]
{"$rows_left_out":109}
{"sheet":"Receiv., liabilities,stock PU","index":10,"n_rows":146,"n_cols":21,"rows_kept":146,"cut":false,"hidden":true,"merged":[[116,5,116,6],[117,5,117,6],[118,5,118,6],[119,5,119,6],[137,7,137,16],[138,7,138,16],[130,7,130,16],[134,0,135,0],[134,5,135,5],[134,6,135,6],[134,7,135,16],[136,7,136,16],[126,0,127,0],[126,5,127,5],[126,6,127,6],[126,7,127,16],[128,7,128,16],[129,7,129,16],[5,8,5,9],[6,8,6,9],[7,8,7,9],[8,8,8,9],[9,8,9,9],[10,8,10,9],[11,8,11,9],[120,5,120,6],[121,5,121,6],[65,8,65,9],[66,8,66,9],[67,8,67,9],[12,8,12,9],[13,8,13,9],[14,8,14,9],[16,8,16,9],[15,8,15,9],[14,5,14,6],[15,5,15,6],[16,5,16,6],[5,5,5,6],[6,5,6,6],[7,5,7,6],[8,5,8,6],[9,5,9,6],[10,5,10,6],[11,5,11,6],[12,5,12,6],[13,5,13,6],[81,7,81,8],[64,5,64,6],[65,5,65,6],[66,5,66,6],[67,5,67,6],[68,5,68,6],[69,5,69,6],[70,5,70,6],[71,5,71,6],[72,5,72,6],[77,7,77,8],[78,7,78,8],[79,7,79,8],[80,7,80,8],[74,5,74,9],[75,7,75,9],[75,5,75,6],[76,7,76,8],[72,8,72,9],[68,8,68,9],[69,8,69,9],[70,8,70,9],[71,8,71,9],[64,8,64,9],[112,8,112,9],[112,10,112,11],[112,12,112,13],[110,8,110,9],[110,10,110,11],[110,12,110,13],[111,8,111,9],[111,10,111,11],[111,12,111,13],[74,10,76,10],[142,0,143,0],[142,5,143,5],[142,6,143,6],[106,14,106,16],[108,8,108,9],[108,10,108,11],[108,12,108,13],[109,8,109,9],[109,10,109,11],[109,12,109,13],[106,0,107,0],[107,8,107,9],[107,10,107,11],[107,12,107,13],[106,8,106,13],[106,5,106,7],[122,5,122,6],[116,8,116,9],[117,8,117,9],[118,8,118,9],[119,8,119,9],[120,8,120,9],[121,8,121,9],[122,8,122,9]]}
[]
[{"$f":"\"Client: \"&IF('Base data'!$B$7=0,\"\",'Base data'!$B$7)","v":"Client: "}]
[]
["Age structure of trade accounts receivables   ",null,null,null,null,null,null,null,null,null,null,null,null,null,null,null,null,null,null,"Hodnoty pre graf"]
[null,null,null,null,null,null,null,null,null,null,"(EUR 000)"]
[null,{"$f":"#REF!","v":{"$error":"#REF!"}},"Podiel",{"$f":"#REF!","v":{"$error":"#REF!"}},"Podiel",{"$f":"'List of required documents'!C61","v":"2011-12-31"},null,"Share",{"$f":"'List of required documents'!E61","v":"2012-03-31"},null,"Share",null,null,null,null,null,null,null,null,{"$f":"F6","v":"2011-12-31"},{"$f":"I6","v":"2012-03-31"}]
["Trade acc. receiv. brutto, from that:",null,{"$f":"IF(B$7=0,\"\",B7/B$7)","v":""},null,{"$f":"IF(D$7=0,\"\",D7/D$7)","v":""},null,null,{"$f":"IF(F$7=0,\"\",F7/F$7)","v":""},null,null,{"$f":"IF(I$7=0,\"\",I7/I$7)","v":""},null,null,null,null,null,null,null,null,{"$f":"F7","v":0},{"$f":"J7","v":0}]
[" - in due",{"$f":"IF(B7=0,\"\",B7-SUM(B10:B14))","v":""},{"$f":"IF(B$7=0,\"\",B8/B$7)","v":""},{"$f":"IF(D7=0,\"\",D7-SUM(D10:D14))","v":""},{"$f":"IF(D$7=0,\"\",D8/D$7)","v":""},{"$f":"IF(F7=0,\"\",F7-SUM(F10:F14))","v":""},null,{"$f":"IF(F$7=0,\"\",F8/F$7)","v":""},{"$f":"IF(I7=0,\"\",I7-SUM(I10:I14))","v":""},null,{"$f":"IF(I$7=0,\"\",I8/I$7)","v":""},null,null,null,null,null,null,null,null,{"$f":"F8","v":""},{"$f":"I8","v":""}]
[" - Overdue total, from that:",{"$f":"IF(SUM(B10:B14)=0,\"\",SUM(B10:B14))","v":""},{"$f":"IF(SUM(B10:B14)=0,\"\",B9/B$7)","v":""},{"$f":"IF(SUM(D10:D14)=0,\"\",SUM(D10:D14))","v":""},{"$f":"IF(SUM(D10:D14)=0,\"\",D9/D$7)","v":""},{"$f":"IF(SUM(F10:F14)=0,\"\",SUM(F10:F14))","v":""},null,{"$f":"IF(SUM(F10:F14)=0,\"\",F9/F$7)","v":""},{"$f":"IF(SUM(I10:I14)=0,\"\",SUM(I10:I14))","v":""},null,{"$f":"IF(SUM(I10:I14)=0,\"\",I9/I$7)","v":""}]
["    - till 30 days after maturity",null,{"$f":"IF(B$7=0,\"\",B10/B$7)","v":""},null,{"$f":"IF(D$7=0,\"\",D10/D$7)","v":""},null,null,{"$f":"IF(F$7=0,\"\",F10/F$7)","v":""},null,null,{"$f":"IF(I$7=0,\"\",I10/I$7)","v":""},null,null,null,null,null,null,null,null,{"$f":"F10","v":0},{"$f":"J10","v":0}]
{"$rows_left_out":137}
{"sheet":"Loans, liabilities, leasing JU","index":11,"n_rows":62,"n_cols":15,"rows_kept":62,"cut":false,"hidden":true,"merged":[[25,0,25,7],[8,11,8,12],[8,13,8,14],[0,3,0,9],[5,0,5,6],[8,0,9,0],[8,1,9,1],[8,2,9,2],[8,3,9,3],[8,4,9,4],[8,6,9,6],[8,7,9,7],[8,8,9,8],[8,9,8,10]]}
[]
[{"$f":"\"Klient: \"&IF('Base data'!$B$7=0,\"\",'Base data'!$B$7)","v":"Klient: "}]
[]
["Prehľad úverov, pôžičiek od bankových i nebankových subjektov a leasingov"]
[]
[]
[]
["Číselné hodnoty (EUR 000), stavy zodpovedajúce stavom vykazovaným vo Výkaze o majetku a záväzkoch"]
["Veriteľ","Druh záväzku 1)","Účel ","Mena 2)","Max.limit","Splátka istiny rok 3)","Dátum splatnosti","Úroková sadzba [% p.a.]","Popis zabezpečenia (vrátane avalu zmenky)",{"$f":"'List of required documents'!B61","v":"2010-12-31"},null,{"$f":"'List of required documents'!C61","v":"2011-12-31"},null,{"$f":"'List of required documents'!E61","v":"2012-03-31"}]
[null,null,null,null,null,{"$f":"'List of required documents'!C61","v":"2011-12-31"},null,null,null,"zostatok celkom","z toho: CPLTD 4)","zostatok celkom","z toho: CPLTD 4)","zostatok celkom","z toho: CPLTD 4)"]
{"$rows_left_out":53}
{"sheet":"Loans, liabilities, leasing PU","index":12,"n_rows":41,"n_cols":18,"rows_kept":41,"cut":false,"hidden":true,"merged":[[5,5,5,7],[3,0,3,15],[6,10,6,11],[6,12,6,13],[6,14,6,15],[6,0,7,0],[6,7,7,7],[6,8,7,8],[6,9,7,9],[6,1,7,1],[6,2,7,2],[6,3,7,3],[6,4,7,4],[6,5,6,6]]}
[]
[{"$f":"\"Client: \"&IF('Base data'!$B$7=0,\"\",'Base data'!$B$7)","v":"Client: "}]
[]
["List of loans, borrowings from bank and nonbank entities and leasings"]
[]
["Numeric values (EUR 000), situation due to the balance sheet"]
["Creditor","Type of liability 1)","Purpose","Currency 2)","Max. limit","Year principal repayment and repayment related to interim period",null,"Tenor","Interest rate [% p.a.]","Description of collateral (including bill aval)",{"$f":"'List of required documents'!B61","v":"2010-12-31"},null,{"$f":"'List of required documents'!C61","v":"2011-12-31"},null,{"$f":"'List of required documents'!E61","v":"2012-03-31"},null,{"$f":"(\"Zmena od \"&TEXT(#REF!,\"dd.mm.yy\")&\" do \"&TEXT(#REF!,\"dd.mm.yy\"))","v":{"$error":"#REF!"}},{"$f":"(\"Zmena od \"&TEXT(#REF!,\"dd.mm.yy\")&\" do \"&TEXT(#REF!,\"dd.mm.yy\"))","v":{"$error":"#REF!"}}]
[null,null,null,null,null,{"$f":"'List of required documents'!C61","v":"2011-12-31"},{"$f":"'List of required documents'!E61","v":"2012-03-31"},null,null,null,"outstanding","from that: CPLTD 4)","outstanding","from that: CPLTD 4)","outstanding","from that: CPLTD 4)",{"$f":"(M8-L8)","v":{"$error":"#VALUE!"}},{"$f":"(P8-M8)","v":{"$error":"#VALUE!"}}]
[null,null,null,null,null,null,null,null,null,null,null,null,null,null,null,null,0,0]
[null,null,null,null,null,null,null,null,null,null,null,null,null,null,null,null,0,0]
{"$rows_left_out":32}
{"sheet":"Additional information","index":13,"n_rows":22,"n_cols":8,"rows_kept":22,"cut":false,"hidden":true,"merged":[]}
[]
[{"$f":"\"Client: \"&IF('Base data'!$B$7=0,\"\",'Base data'!$B$7)","v":"Client: "}]
[]
["Additional information *)"]
[]
["Comment to business"]
[]
[]
[]
[]
{"$rows_left_out":13}
{"sheet":"Owners management, shares PU ","index":14,"n_rows":74,"n_cols":10,"rows_kept":74,"cut":false,"hidden":true,"merged":[[0,1,0,6],[61,0,61,4],[6,4,6,9],[8,4,8,9],[9,4,9,9],[10,4,10,9],[50,4,51,4],[33,5,33,9],[34,5,34,9],[35,5,35,9],[47,0,47,9],[50,0,51,0],[50,2,51,2],[50,3,51,3],[50,5,51,5],[50,1,51,1],[50,6,51,6],[50,7,51,7],[50,8,51,8],[50,9,51,9],[29,5,29,9],[30,5,30,9],[31,5,31,9],[32,5,32,9],[28,5,28,9],[12,4,12,9],[13,4,13,9],[7,4,7,9],[11,4,11,9],[10,1,10,2],[12,1,12,2],[13,1,13,2],[6,1,6,2],[7,1,7,2],[8,1,8,2],[9,1,9,2],[11,1,11,2],[34,1,34,2],[35,1,35,2],[28,1,28,2],[29,1,29,2],[30,1,30,2],[31,1,31,2],[32,1,32,2],[33,1,33,2]]}
[]
[{"$f":"\"Client: \"&IF('Base data'!$B$7=0,\"\",'Base data'!$B$7)","v":"Client: "}]
[]
["Ownership structure"]
[]
["Structure to the date:",{"$f":"'List of required documents'!E61","v":"2012-03-31"}]
["Name of the owner","Share on register capital [%]",null,"Owner from"]
[]
[]
[]
{"$rows_left_out":65}
{"sheet":"A-Assets and liab. projections","index":15,"n_rows":38,"n_cols":6,"rows_kept":38,"cut":false,"hidden":true,"merged":[[3,0,3,5],[35,0,36,5],[7,0,8,0],[7,1,8,1],[7,2,8,2],[7,3,8,3],[7,4,8,4],[7,5,8,5]]}
[]
[{"$f":"\"Klient: \"&IF('Base data'!$B$7=0,\"\",'Base data'!$B$7)","v":"Klient: "}]
[]
["Projekcie vyplňte prosím v prípade investičného úveru (na bežný rok a ďalšie dva nasledujúce roky) a v prípade zákazkovej výroby (na 1 rok, príp. minimálne prehľad kontraktov zazmluvnenosti)"]
[]
["Projekcia Výkazu o majetku a záväzkoch"]
[]
["P.č.","Ukazovateľ","Posledné daňové obdobie","K 31.12. bežného roka","K 31.12 bežného roka +1","K 31.12. bežného roka +2"]
[]
[1,"MAJETOK CELKOM r.č. 2+3+4+5+6+7",{"$f":"C11+C12+C16+C17+C18+C21","v":0},{"$f":"D11+D12+D16+D17+D18+D21","v":0},{"$f":"E11+E12+E16+E17+E18+E21","v":0},{"$f":"F11+F12+F16+F17+F18+F21","v":0}]
{"$rows_left_out":29}
{"sheet":"A-Income and expend. project.","index":16,"n_rows":122,"n_cols":6,"rows_kept":122,"cut":false,"hidden":true,"merged":[[5,4,6,4],[5,5,6,5],[5,0,6,0],[5,1,6,1],[5,2,6,2],[5,3,6,3]]}
[]
[{"$f":"\"Klient: \"&IF('Base data'!$B$7=0,\"\",'Base data'!$B$7)","v":"Klient: "}]
[]
["Projekcia Výkazu o príjmoch a výdavkoch"]
[]
["P.č.","Ukazovateľ","Posledné daňové obdobie","K 31.12. bežného roka","K 31.12 bežného roka +1","K 31.12. bežného roka +2"]
[]
[1,"PRÍJMY CELKOM r.č. 2+3+4",{"$f":"C9+C11+C11","v":0},{"$f":"D9+D11+D11","v":0},{"$f":"E9+E11+E11","v":0},{"$f":"F9+F11+F11","v":0}]
[2,"Príjmy z predaja tovaru"]
[3,"Príjmy z predaja vlastných výrobkov a služieb"]
{"$rows_left_out":113}
{"sheet":"A - Balance sheet projections","index":17,"n_rows":64,"n_cols":6,"rows_kept":64,"cut":false,"hidden":true,"merged":[[3,0,3,5],[7,5,8,5],[7,0,8,0],[7,1,8,1],[7,2,8,2],[7,3,8,3],[7,4,8,4]]}
[]
[{"$f":"\"Client: \"&IF('Base data'!$B$7=0,\"\",'Base data'!$B$7)","v":"Client: "}]
[]
["Fill in in case of investment loan (for current year and next two years) and custom manufacturing (for one next yera alternatively min list of future contracts)."]
[]
["Projections of balance sheet"]
[]
["No.","Indicator","Last tax period","as of 31.12. of current year","as of 31.12. of current year + 1","as of 31.12. of current year + 2"]
[]
[1,"Receivables related to unpaid register capital"]
{"$rows_left_out":55}
{"sheet":"B - Profit and loss projections","index":18,"n_rows":55,"n_cols":6,"rows_kept":55,"cut":false,"hidden":true,"merged":[[5,4,6,4],[5,5,6,5],[5,0,6,0],[5,1,6,1],[5,2,6,2],[5,3,6,3]]}
[]
[{"$f":"\"Client: \"&IF('Base data'!$B$7=0,\"\",'Base data'!$B$7)","v":"Client: "}]
[]
["Profit and loss statement projections"]
[]
["No.","Indicator","Last tax period","as of 31.12. of current year","as of 31.12. of current year + 1","as of 31.12. of current year + 2"]
[]
[1,"Revenues from sale of goods"]
[2,"Costs of sold goods"]
[3,"Revenues from sale of own products and services"]
{"$rows_left_out":46}
{"sheet":"Verzia","index":19,"n_rows":1,"n_cols":6,"rows_kept":1,"cut":false,"hidden":true,"merged":[]}
["Verzia","3.1.0","Datum","2011-11-22","LastEdit","SBE"]

{"sheet":"Preliminary interest-FACTORING","index":20,"n_rows":32,"n_cols":10,"rows_kept":32,"cut":false,"hidden":false,"merged":[[28,6,28,9],[28,3,28,5],[5,0,6,0],[5,1,5,2],[5,3,5,4],[7,0,8,0],[7,1,7,2],[7,3,7,4],[9,0,10,0],[9,1,9,2],[9,3,9,4],[11,0,12,0],[11,1,11,2],[11,3,11,4],[17,0,18,0],[17,1,17,2],[17,3,17,4],[13,0,14,0],[13,1,13,2],[13,3,13,4],[15,0,16,0],[15,1,15,2],[15,3,15,4],[19,0,20,0],[19,1,19,2],[19,3,19,4],[21,0,22,0],[21,1,21,2],[21,3,21,4],[23,0,24,0],[23,1,23,2],[23,3,23,4],[25,0,26,0],[25,1,25,2],[25,3,25,4],[29,3,29,5],[30,3,30,5],[31,3,31,5],[29,6,29,9],[30,6,30,9],[31,6,31,9]]}
[]
[{"$f":"\"Client: \"&IF('Base data'!$B$7=0,\"\",'Base data'!$B$7)","v":"Client: "}]
[]
["Preliminary interest in factoring"]
[]
["No.","Name of customer",null,"Adresa",null,"country","IČO","delivery terms","currency ","cooperation from"]
[null,"revenues for last tax period","planed revenues for current year","thereof, realized","maturity of invoices","real maturity","number of invoices in month","average month value of invoices","max value of invoices in month","reguired factoring limit \ncurrency / maturity"]
["1.",null,null,null,null," "]
[]
["2."]
{"$rows_left_out":22}